{"text_format":"1","workbook":"xlsx","n_sheets":8,"sheets":["Apresentação","Filtros","Cubos","Somas","Geral","Estado","Resultados","Iniciativas"],"not_rendered":{"charts":10,"images":0,"macros":1,"external_links":0,"defined_names":27,"comments":0,"pivot_tables":26},"unopened":[],"bounds":{"document_bytes":16777216,"sheet_cells":100000,"rows_first":2000,"rows_last":500,"rows_between":2000,"halvings":0,"cell_chars":16384,"cell_head_chars":4096},"cells_cut":0,"cells_raw":0,"read":"whole","date_system":"1900"}

{"sheet":"Apresentação","index":0,"n_rows":0,"n_cols":0,"rows_kept":0,"cut":false,"hidden":false,"merged":[]}

{"sheet":"Filtros","index":1,"n_rows":0,"n_cols":0,"rows_kept":0,"cut":false,"hidden":false,"merged":[]}

{"sheet":"Cubos","index":2,"n_rows":36,"n_cols":66,"rows_kept":36,"cut":false,"hidden":true,"merged":[]}
["Atividades de gestão do Programa no Sistema Sebrae",null,null,"Atividades de gestão do Programa no Sebrae Nacional",null,null,"Iniciativas de execução do Programa no Sebrae Nacional",null,null,"Atividades de gestão do Programa nos Sebrae UF",null,null,null,"Iniciativas de execução do Programa no Sebrae Nacional",null,null,null,"Sebrae UF do Programa ",null,null,null,"Orçamento do Programa no Sebrae Nacional",null,null,null,"Orçamento do Programa nos estados",null,null,null,null,"Sebrae UF do Programa ",null,null,"Sebrae NA - Clientes do Programa",null,null,"Sebrae UF - Clientes do Programa",null,null,"Sebrae NA - Clientes do Programa nas iniciativas",null,null,"Sebrae UF - Clientes do Programa nas iniciativas",null,null,"Sebrae UF - Clientes atendidos do Programa nas iniciativas",null,null,"Sebrae UF - Clientes do Programa",null,null,"Sebrae UF - Clientes do Programa - PN",null,null,"Sebrae UF - Clientes do Programa - PF",null,null,"Sebrae UF - Clientes do Programa",null,null,null,"Sebrae UF - Inciativas Gestão Programa",null,null,"Sebrae UF - Inciativas Execução Programa"]
[null,null,null,null,null,null,null,null,null,null,null,null,null,null,null,null,null,null,null,null,null,null,null,null,null,null,null,null,null,null,null,null,null,null,null,null,null,null,null,null,null,null,null,null,null,null,null,null,"Sebrae","(Vários itens)",null,"Sebrae","(Vários itens)",null,"Sebrae","(Vários itens)",null,"Sebrae","(Vários itens)"]
[null,null,null,null,null,null,null,null,null,null,null,null,null,null,null,null,null,null,null,null,null,"Sebrae","SEBRAE/NA",null,null,null,null,null,null,null,null,null,null,"Sebrae","SEBRAE/NA",null,"Sebrae","(Vários itens)",null,null,null,null,null,null,null,null,null,null,"Iniciativa por Tipo","Atividade",null,"Iniciativa por Tipo","Atividade",null,"Iniciativa por Tipo","Atividade",null,"Iniciativa por Tipo","Atividade"]
["Sebrae","All",null,"Sebrae","SEBRAE/NA",null,"Sebrae","SEBRAE/NA",null,null,null,null,null,null,null,null,null,null,null,null,null,null,null,null,null,"Sebrae","(Vários itens)","Todos os estados exceto o Sebrae Nacional",null,null,null,null,null,"Iniciativa por Tipo","Atividade",null,"Iniciativa por Tipo","Atividade",null,"Sebrae","SEBRAE/NA",null,"Sebrae","(Vários itens)",null,"Sebrae","All",null,"Iniciativa por Tipologia","Desenvolvimento de Produtos e Serviços",null,"Iniciativa por Tipologia","Desenvolvimento de Produtos e Serviços",null,"Iniciativa por Tipologia","Desenvolvimento de Produtos e Serviços",null,"Iniciativa por Tipologia","Desenvolvimento de Produtos e Serviços",null,null,"Sebrae","(Vários itens)",null,"Sebrae","(Vários itens)"]
["Iniciativa por Tipo","Desenvolvimento de Produtos e Serviços",null,"Iniciativa por Tipo","Desenvolvimento de Produtos e Serviços",null,"Iniciativa por Tipo","(Vários itens)",null,"Iniciativa por Tipo","Desenvolvimento de Produtos e Serviços",null,null,"Iniciativa por Tipo","(Vários itens)",null,null,null,null,null,null,"Rótulos de Linha","Valor de Despesa Orçado - Ajustado","Valor de Despesa Executado",null,null,null,null,null,null,"Natureza Orçamentária por Código e Descrição","6.1.2.0 - Contribuição Social do Sebrae/NA",null,"Iniciativa por Tipologia","Desenvolvimento de Produtos e Serviços",null,"Iniciativa por Tipologia","Desenvolvimento de Produtos e Serviços",null,"Iniciativa por Tipo","(Vários itens)",null,"Iniciativa por Tipo","(Vários itens)",null,"Aceitabilidade","Aceito",null,"Público Alvo","(Vários itens)",null,"Público Alvo","(Vários itens)",null,"Público Alvo","(Vários itens)",null,"Público Alvo","(Vários itens)",null,null,"Iniciativa por Tipo","Atividade",null,"Iniciativa por Tipo","(Vários itens)"]
[null,null,null,null,null,null,null,null,null,null,null,null,null,null,null,null,null,null,null,null,null,null,null,null,null,"Rótulos de Linha","Valor de Despesa Orçado - Ajustado","Valor de Despesa Executado","Valor de Receita Iniciativa Orçado - Ajustado",null,null,null,null,null,null,null,null,null,null,null,null,null,null,null,null,null,null,null,null,null,null,null,null,null,null,null,null,null,null,null,null,"Iniciativa por Tipologia","Desenvolvimento de Produtos e Serviços",null,"Iniciativa por Tipologia","All"]
["Rótulos de Linha","Nº de Iniciativas - Ajustado",null,"Rótulos de Linha","Nº de Iniciativas - Ajustado",null,"Rótulos de Linha","Nº de Iniciativas - Ajustado",null,"Nº de Iniciativas - Ajustado",null,null,null,"Nº de Iniciativas - Ajustado",null,null,null,"Rótulos de Linha","Nº de Iniciativas - Ajustado","Valor de Despesa Orçado - Ajustado",null,null,null,null,null,"NI - Não Informado",null,null,0,null,"Rótulos de Linha","Valor de Receita Iniciativa Orçado - Ajustado",null,"Rótulos de Linha","Nº de Clientes Planejado - Ajustado",null,"Rótulos de Linha","Nº de Clientes Planejado - Ajustado",null,"Rótulos de Linha","Nº de Clientes Planejado - Ajustado",null,"Rótulos de Linha","Nº de Clientes Planejado - Ajustado",null,"Rótulos de Linha","N° de Clientes",null,"Rótulos de Linha","Nº de Clientes Planejado - Ajustado",null,"Rótulos de Linha","Nº de Clientes Planejado - Ajustado",null,"Rótulos de Linha","Nº de Clientes Planejado - Ajustado",null,"Nº de Clientes Planejado - Ajustado","Rótulos de Coluna"]
["Cliente em Foco",12,null,null,null,null,null,null,null,"Nome de Programa","Descrição de Sebrae","Total",null,"Nome de Programa","Descrição de Sebrae","Total",null,"AC",2,10693251,null,null,null,null,null,"3.1.2.1 - Serviços Especializados",131884334,null,null,null,"AC",897764,null,null,null,null,"Microempreendedor Individual",479460,null,null,null,null,"Microempreendedor Individual",36524,null,null,null,null,"AC",20742,null,"AC",12982,null,"AC",7760,null,"Rótulos de Linha","Pessoas Físicas","Pequenos Negócios",null,"Rótulos de Linha","Nº de Iniciativas - Ajustado",null,"Rótulos de Linha","Nº de Iniciativas - Ajustado"]
[null,null,null,null,null,null,null,null,null,"Cliente em Foco","SEBRAE/AC",1,null,"Cliente em Foco","SEBRAE/AC",1,null,"AM",1,16097000,null,null,null,null,null,"3.1.2.2 - Serviços Contratados",21996933,null,null,null,"AM",6962100,null,null,null,null,"Microempresa",327297,null,null,null,null,"Microempresa",10779,null,null,null,null,"AL",null,null,"AL",null,null,"AL",null,null,"AC",7760,12982,null,"AC",1,null,"AC",1]
[null,null,null,null,null,null,null,null,null,"Cliente em Foco","SEBRAE/AM",1,null,"Cliente em Foco","SEBRAE/SP",12,null,"ES",1,25360461,null,null,null,null,null,"3.1.3.1 - Despesas com Viagens",3553005,null,null,null,"ES",13805561,null,null,null,null,"Empresa de Pequeno Porte",69830,null,null,null,null,"Empresa de Pequeno Porte",3020,null,null,null,null,"AM",56430,null,"AM",28430,null,"AM",28000,null,"AL",null,null,null,"AL",null,null,"SP",12]
{"$rows_left_out":27}
{"sheet":"Somas","index":3,"n_rows":45,"n_cols":14,"rows_kept":45,"cut":false,"hidden":true,"merged":[]}
["Programas Sistema +1","Programas Nacionais","Iniciativas - NA","Sebrae UF","Atividades gestao - UF","Soma de Total"]
[2,1,{"$f":"IFERROR(GETPIVOTDATA(\"[Measures].[Nº de Iniciativas - Ajustado]\",Cubos!$G$7),0)","v":0},13,12,13]
[]
[]
["Estado","Iniciativas Gestão","Iniciativas Execução","Iniciaitvas","CSN","Orçamento","Clientes","$\\Cliente","Universo PN","Clientes PN","% Cobertura","População","Clientes PF","% População"]
["AC",{"$f":"VLOOKUP(Tabela5[[#This Row],[Estado]],Cubos!$BJ$9:$BK$35,2,FALSE)","v":1},{"$f":"VLOOKUP(Tabela5[[#This Row],[Estado]],Cubos!$BM$9:$BN$35,2,FALSE)","v":1},{"$f":"VLOOKUP(Tabela5[[#This Row],[Estado]],Cubos!$R$8:$T$34,2,FALSE)","v":2},{"$f":"VLOOKUP(Tabela5[[#This Row],[Estado]],Cubos!$AE$8:$AF$34,2,FALSE)","v":897764},{"$f":"VLOOKUP(A6,Cubos!$R$8:$T$34,3,FALSE)","v":10693251},{"$f":"VLOOKUP(Tabela5[[#This Row],[Estado]],Cubos!$AW$8:$AX$34,2,FALSE)","v":20742},{"$f":"IFERROR(ROUND(Tabela5[[#This Row],[Orçamento]]/Tabela5[[#This Row],[Clientes]],2),#N/A)","v":515.54},28439,{"$f":"VLOOKUP(Tabela5[[#This Row],[Estado]],Cubos!$AZ$8:$BA$34,2,FALSE)","v":12982},{"$f":"IF(Tabela5[[#This Row],[Clientes PN]]>0,Tabela5[[#This Row],[Clientes PN]]/Tabela5[[#This Row],[Universo PN]],#N/A)","v":0.45648581173740288},881935,{"$f":"VLOOKUP(Tabela5[[#This Row],[Estado]],Cubos!$BC$8:$BD$34,2,FALSE)","v":7760},{"$f":"IF(Tabela5[[#This Row],[Clientes PF]]>0,Tabela5[[#This Row],[Clientes PF]]/Tabela5[[#This Row],[População]],#N/A)","v":8.7988343812185708E-3}]
["AL",{"$f":"VLOOKUP(Tabela5[[#This Row],[Estado]],Cubos!$BJ$9:$BK$35,2,FALSE)","v":0},{"$f":"VLOOKUP(Tabela5[[#This Row],[Estado]],Cubos!$BM$9:$BN$35,2,FALSE)","v":{"$error":"#N/A"}},{"$f":"VLOOKUP(Tabela5[[#This Row],[Estado]],Cubos!$R$8:$T$34,2,FALSE)","v":{"$error":"#N/A"}},{"$f":"VLOOKUP(Tabela5[[#This Row],[Estado]],Cubos!$AE$8:$AF$34,2,FALSE)","v":{"$error":"#N/A"}},{"$f":"VLOOKUP(A7,Cubos!$R$8:$T$34,3,FALSE)","v":{"$error":"#N/A"}},{"$f":"VLOOKUP(Tabela5[[#This Row],[Estado]],Cubos!$AW$8:$AX$34,2,FALSE)","v":0},{"$f":"IFERROR(ROUND(Tabela5[[#This Row],[Orçamento]]/Tabela5[[#This Row],[Clientes]],2),#N/A)","v":{"$error":"#N/A"}},178597,{"$f":"VLOOKUP(Tabela5[[#This Row],[Estado]],Cubos!$AZ$8:$BA$34,2,FALSE)","v":0},{"$f":"IF(Tabela5[[#This Row],[Clientes PN]]>0,Tabela5[[#This Row],[Clientes PN]]/Tabela5[[#This Row],[Universo PN]],#N/A)","v":{"$error":"#N/A"}},3337357,{"$f":"VLOOKUP(Tabela5[[#This Row],[Estado]],Cubos!$BC$8:$BD$34,2,FALSE)","v":0},{"$f":"IF(Tabela5[[#This Row],[Clientes PF]]>0,Tabela5[[#This Row],[Clientes PF]]/Tabela5[[#This Row],[População]],#N/A)","v":{"$error":"#N/A"}}]
["AM",{"$f":"VLOOKUP(Tabela5[[#This Row],[Estado]],Cubos!$BJ$9:$BK$35,2,FALSE)","v":1},{"$f":"VLOOKUP(Tabela5[[#This Row],[Estado]],Cubos!$BM$9:$BN$35,2,FALSE)","v":{"$error":"#N/A"}},{"$f":"VLOOKUP(Tabela5[[#This Row],[Estado]],Cubos!$R$8:$T$34,2,FALSE)","v":1},{"$f":"VLOOKUP(Tabela5[[#This Row],[Estado]],Cubos!$AE$8:$AF$34,2,FALSE)","v":6962100},{"$f":"VLOOKUP(A8,Cubos!$R$8:$T$34,3,FALSE)","v":16097000},{"$f":"VLOOKUP(Tabela5[[#This Row],[Estado]],Cubos!$AW$8:$AX$34,2,FALSE)","v":56430},{"$f":"IFERROR(ROUND(Tabela5[[#This Row],[Orçamento]]/Tabela5[[#This Row],[Clientes]],2),#N/A)","v":285.26},155757,{"$f":"VLOOKUP(Tabela5[[#This Row],[Estado]],Cubos!$AZ$8:$BA$34,2,FALSE)","v":28430},{"$f":"IF(Tabela5[[#This Row],[Clientes PN]]>0,Tabela5[[#This Row],[Clientes PN]]/Tabela5[[#This Row],[Universo PN]],#N/A)","v":0.18252791206815744},4144597,{"$f":"VLOOKUP(Tabela5[[#This Row],[Estado]],Cubos!$BC$8:$BD$34,2,FALSE)","v":28000},{"$f":"IF(Tabela5[[#This Row],[Clientes PF]]>0,Tabela5[[#This Row],[Clientes PF]]/Tabela5[[#This Row],[População]],#N/A)","v":6.7557834935459346E-3}]
["AP",{"$f":"VLOOKUP(Tabela5[[#This Row],[Estado]],Cubos!$BJ$9:$BK$35,2,FALSE)","v":0},{"$f":"VLOOKUP(Tabela5[[#This Row],[Estado]],Cubos!$BM$9:$BN$35,2,FALSE)","v":{"$error":"#N/A"}},{"$f":"VLOOKUP(Tabela5[[#This Row],[Estado]],Cubos!$R$8:$T$34,2,FALSE)","v":{"$error":"#N/A"}},{"$f":"VLOOKUP(Tabela5[[#This Row],[Estado]],Cubos!$AE$8:$AF$34,2,FALSE)","v":{"$error":"#N/A"}},{"$f":"VLOOKUP(A9,Cubos!$R$8:$T$34,3,FALSE)","v":{"$error":"#N/A"}},{"$f":"VLOOKUP(Tabela5[[#This Row],[Estado]],Cubos!$AW$8:$AX$34,2,FALSE)","v":0},{"$f":"IFERROR(ROUND(Tabela5[[#This Row],[Orçamento]]/Tabela5[[#This Row],[Clientes]],2),#N/A)","v":{"$error":"#N/A"}},35411,{"$f":"VLOOKUP(Tabela5[[#This Row],[Estado]],Cubos!$AZ$8:$BA$34,2,FALSE)","v":0},{"$f":"IF(Tabela5[[#This Row],[Clientes PN]]>0,Tabela5[[#This Row],[Clientes PN]]/Tabela5[[#This Row],[Universo PN]],#N/A)","v":{"$error":"#N/A"}},845731,{"$f":"VLOOKUP(Tabela5[[#This Row],[Estado]],Cubos!$BC$8:$BD$34,2,FALSE)","v":0},{"$f":"IF(Tabela5[[#This Row],[Clientes PF]]>0,Tabela5[[#This Row],[Clientes PF]]/Tabela5[[#This Row],[População]],#N/A)","v":{"$error":"#N/A"}}]
["BA",{"$f":"VLOOKUP(Tabela5[[#This Row],[Estado]],Cubos!$BJ$9:$BK$35,2,FALSE)","v":0},{"$f":"VLOOKUP(Tabela5[[#This Row],[Estado]],Cubos!$BM$9:$BN$35,2,FALSE)","v":{"$error":"#N/A"}},{"$f":"VLOOKUP(Tabela5[[#This Row],[Estado]],Cubos!$R$8:$T$34,2,FALSE)","v":{"$error":"#N/A"}},{"$f":"VLOOKUP(Tabela5[[#This Row],[Estado]],Cubos!$AE$8:$AF$34,2,FALSE)","v":{"$error":"#N/A"}},{"$f":"VLOOKUP(A10,Cubos!$R$8:$T$34,3,FALSE)","v":{"$error":"#N/A"}},{"$f":"VLOOKUP(Tabela5[[#This Row],[Estado]],Cubos!$AW$8:$AX$34,2,FALSE)","v":0},{"$f":"IFERROR(ROUND(Tabela5[[#This Row],[Orçamento]]/Tabela5[[#This Row],[Clientes]],2),#N/A)","v":{"$error":"#N/A"}},960907,{"$f":"VLOOKUP(Tabela5[[#This Row],[Estado]],Cubos!$AZ$8:$BA$34,2,FALSE)","v":0},{"$f":"IF(Tabela5[[#This Row],[Clientes PN]]>0,Tabela5[[#This Row],[Clientes PN]]/Tabela5[[#This Row],[Universo PN]],#N/A)","v":{"$error":"#N/A"}},14873064,{"$f":"VLOOKUP(Tabela5[[#This Row],[Estado]],Cubos!$BC$8:$BD$34,2,FALSE)","v":0},{"$f":"IF(Tabela5[[#This Row],[Clientes PF]]>0,Tabela5[[#This Row],[Clientes PF]]/Tabela5[[#This Row],[População]],#N/A)","v":{"$error":"#N/A"}}]
{"$rows_left_out":36}
{"sheet":"Geral","index":4,"n_rows":46,"n_cols":7,"rows_kept":46,"cut":false,"hidden":false,"merged":[]}
[null,"Programas Nacionais","Sebrae UF - Gestão","Atividades gestão - NA","Iniciativas Execução - NA","Atividades gestao - UF","Iniciativas Execução - UF"]
[null,{"$f":"Somas!A2-1","v":1},{"$f":"Somas!D2-1","v":12},{"$f":"Somas!C2","v":0},{"$f":"Somas!C2","v":0},{"$f":"Somas!E2","v":12},{"$f":"GETPIVOTDATA(\"Total\",Somas!$F$1)","v":13}]
[]
[]
[]
[]
[]
[]
[]
[]
{"$rows_left_out":37}
{"sheet":"Estado","index":5,"n_rows":30,"n_cols":7,"rows_kept":30,"cut":false,"hidden":false,"merged":[]}
["Estado","Iniciativas Gestão","Iniciaitvas Execução","CSN","Orçamento","Contrapartida","% Contrapartida"]
[{"$f":"Somas!A6","v":"AC"},{"$f":"Somas!B6","v":1},{"$f":"IFERROR(Somas!C6,0)","v":1},{"$f":"IFERROR(Somas!E6,0)","v":897764},{"$f":"IFERROR(Somas!F6,0)","v":10693251},{"$f":"Tabela1[[#This Row],[Orçamento]]-Tabela1[[#This Row],[CSN]]","v":9795487},{"$f":"IFERROR(Tabela1[[#This Row],[Contrapartida]]/Tabela1[[#This Row],[Orçamento]],0)","v":0.91604386729536225}]
[{"$f":"Somas!A7","v":"AL"},{"$f":"Somas!B7","v":0},{"$f":"IFERROR(Somas!C7,0)","v":0},{"$f":"IFERROR(Somas!E7,0)","v":0},{"$f":"IFERROR(Somas!F7,0)","v":0},{"$f":"Tabela1[[#This Row],[Orçamento]]-Tabela1[[#This Row],[CSN]]","v":0},{"$f":"IFERROR(Tabela1[[#This Row],[Contrapartida]]/Tabela1[[#This Row],[Orçamento]],0)","v":0}]
[{"$f":"Somas!A8","v":"AM"},{"$f":"Somas!B8","v":1},{"$f":"IFERROR(Somas!C8,0)","v":0},{"$f":"IFERROR(Somas!E8,0)","v":6962100},{"$f":"IFERROR(Somas!F8,0)","v":16097000},{"$f":"Tabela1[[#This Row],[Orçamento]]-Tabela1[[#This Row],[CSN]]","v":9134900},{"$f":"IFERROR(Tabela1[[#This Row],[Contrapartida]]/Tabela1[[#This Row],[Orçamento]],0)","v":0.5674908368018885}]
[{"$f":"Somas!A9","v":"AP"},{"$f":"Somas!B9","v":0},{"$f":"IFERROR(Somas!C9,0)","v":0},{"$f":"IFERROR(Somas!E9,0)","v":0},{"$f":"IFERROR(Somas!F9,0)","v":0},{"$f":"Tabela1[[#This Row],[Orçamento]]-Tabela1[[#This Row],[CSN]]","v":0},{"$f":"IFERROR(Tabela1[[#This Row],[Contrapartida]]/Tabela1[[#This Row],[Orçamento]],0)","v":0}]
[{"$f":"Somas!A10","v":"BA"},{"$f":"Somas!B10","v":0},{"$f":"IFERROR(Somas!C10,0)","v":0},{"$f":"IFERROR(Somas!E10,0)","v":0},{"$f":"IFERROR(Somas!F10,0)","v":0},{"$f":"Tabela1[[#This Row],[Orçamento]]-Tabela1[[#This Row],[CSN]]","v":0},{"$f":"IFERROR(Tabela1[[#This Row],[Contrapartida]]/Tabela1[[#This Row],[Orçamento]],0)","v":0}]
[{"$f":"Somas!A11","v":"CE"},{"$f":"Somas!B11","v":0},{"$f":"IFERROR(Somas!C11,0)","v":0},{"$f":"IFERROR(Somas!E11,0)","v":0},{"$f":"IFERROR(Somas!F11,0)","v":0},{"$f":"Tabela1[[#This Row],[Orçamento]]-Tabela1[[#This Row],[CSN]]","v":0},{"$f":"IFERROR(Tabela1[[#This Row],[Contrapartida]]/Tabela1[[#This Row],[Orçamento]],0)","v":0}]
[{"$f":"Somas!A12","v":"DF"},{"$f":"Somas!B12","v":0},{"$f":"IFERROR(Somas!C12,0)","v":0},{"$f":"IFERROR(Somas!E12,0)","v":0},{"$f":"IFERROR(Somas!F12,0)","v":0},{"$f":"Tabela1[[#This Row],[Orçamento]]-Tabela1[[#This Row],[CSN]]","v":0},{"$f":"IFERROR(Tabela1[[#This Row],[Contrapartida]]/Tabela1[[#This Row],[Orçamento]],0)","v":0}]
[{"$f":"Somas!A13","v":"ES"},{"$f":"Somas!B13","v":1},{"$f":"IFERROR(Somas!C13,0)","v":0},{"$f":"IFERROR(Somas!E13,0)","v":13805561},{"$f":"IFERROR(Somas!F13,0)","v":25360461},{"$f":"Tabela1[[#This Row],[Orçamento]]-Tabela1[[#This Row],[CSN]]","v":11554900},{"$f":"IFERROR(Tabela1[[#This Row],[Contrapartida]]/Tabela1[[#This Row],[Orçamento]],0)","v":0.45562657555791275}]
[{"$f":"Somas!A14","v":"GO"},{"$f":"Somas!B14","v":1},{"$f":"IFERROR(Somas!C14,0)","v":0},{"$f":"IFERROR(Somas!E14,0)","v":12922459},{"$f":"IFERROR(Somas!F14,0)","v":20080000},{"$f":"Tabela1[[#This Row],[Orçamento]]-Tabela1[[#This Row],[CSN]]","v":7157541},{"$f":"IFERROR(Tabela1[[#This Row],[Contrapartida]]/Tabela1[[#This Row],[Orçamento]],0)","v":0.35645124501992032}]
{"$rows_left_out":21}
{"sheet":"Resultados","index":6,"n_rows":204,"n_cols":37,"rows_kept":204,"cut":false,"hidden":false,"merged":[[7,30,8,30],[7,31,8,31],[7,32,8,32],[7,33,7,36]]}
[null,"Programa",{"$f":"C9","v":"AC"},{"$f":"D9","v":"AL"},"AM","AP","BA","CE","DF","ES","GO","MA","MG","MS","MT","PA","PB","PE","PI","PR","RJ","RN","RO","RR","RS","SC","SE","SP","TO"]
["Qt. Indicadores ",{"$f":"COUNTA(B10:B201)","v":9},{"$f":"COUNTA(C10:C201)","v":6},0,6,0,0,0,0,6,4,5,0,4,0,0,6,0,0,5,0,0,0,6,8,7,5,0,0]
["% Adesão aos indicadores",{"$f":"B2/$B$2","v":1},{"$f":"C2/$B$2","v":0.66666666666666663},0,0.66666666666666663,0,0,0,0,0.66666666666666663,0.44444444444444442,0.55555555555555558,0,0.44444444444444442,0,0,0.66666666666666663,0,0,0.55555555555555558,0,0,0,0.66666666666666663,0.88888888888888884,0.77777777777777779,0.55555555555555558,0,0]
[]
["Iniciativa por Tipo","Desenvolvimento de Produtos e Serviços"]
["Ano","2021"]
[]
["Valor Meta",null,"Sigla de Sebrae",null,null,null,null,null,null,null,null,null,null,null,null,null,null,null,null,null,null,null,null,null,null,null,null,null,null,null,"Qtd. UFs que aderiram ao Programa","Qtd. UFs que aderiram ao indicador","% Adesão de UFs ao indicador","Análise de Metas"]
["Nome de Programa","Resultado","AC","AL","AM","AP","BA","CE","DF","ES","GO","MA","MG","MS","MT","PA","PB","PE","PI","PR","RJ","RN","RO","RR","RS","SC","SE","SP","TO",null,null,null,null,"Soma","Média","Mínimo","Máximo"]
["Cliente em Foco","PG_Atendimento aos MEI Nascentes - % - Obter",0,null,null,null,null,null,null,null,null,null,null,null,null,null,null,null,null,null,null,null,null,null,9,13,null,null,null,null,{"$f":"IF(ISBLANK(A10),\"\", Somas!$D$2)","v":13},{"$f":"IF(ISBLANK(A10),\"\",COUNTA(C10:AC10))","v":3},{"$f":"IF(ISBLANK(A10),\"\",AF10/AE10)","v":0.23076923076923078},{"$f":"IF(ISBLANK(A10),\"\", SUM(C10:AC10))","v":22},{"$f":"IF(ISBLANK(A10),\"\", AH10/AF10)","v":7.333333333333333},{"$f":"IF(ISBLANK(A10),\"\", MIN(C10:AC10))","v":0},{"$f":"IF(ISBLANK(A10),\"\", MAX(C10:AC10))","v":13}]
{"$rows_left_out":195}
{"sheet":"Iniciativas","index":7,"n_rows":31,"n_cols":9,"rows_kept":31,"cut":false,"hidden":false,"merged":[]}
[]
["Natureza Orçamentária por Código e Descrição","(Vários itens)"]
[]
[null,null,null,null,null,null,"Valores"]
["Nome de Programa","Descrição de Sebrae","Nº da Iniciativa","Descrição de Tipo de Iniciativa","Descrição de Tipologia por Tipo","Iniciativa","Nº de Iniciativas - Ajustado","Valor de Despesa Orçado - Ajustado","Valor de Receita Iniciativa Orçado - Ajustado"]
["Cliente em Foco","SEBRAE/AC","AC000476ATAT","Atividade","Atendimento","Atendimento Remoto - AC",1,222400,0]
["Cliente em Foco","SEBRAE/AC","AC000629ATPS","Atividade","Desenvolvimento de Produtos e Serviços","AC - Clientes em Foco",1,10470851,897764]
["Cliente em Foco","SEBRAE/AM","AM000917ATPS","Atividade","Desenvolvimento de Produtos e Serviços","AM - CLIENTE EM FOCO",1,16097000,6962100]
["Cliente em Foco","SEBRAE/ES","ES001042ATPS","Atividade","Desenvolvimento de Produtos e Serviços","PROGRAMA Cliente em Foco",1,25360461,13805561]
["Cliente em Foco","SEBRAE/GO","GO001004ATPS","Atividade","Desenvolvimento de Produtos e Serviços","Gestão do Programa - Cliente em Foco",1,20080000,12922459]
{"$rows_left_out":21}